{"text_format":"1","workbook":"xlsx","n_sheets":8,"sheets":["MENU","NPT","AVERAGE COST","INITIAL DATA","AFE SUMMARY","AFE DETAILED","OPERATIONS","LISTS"],"not_rendered":{"charts":0,"images":5,"macros":1,"external_links":0,"defined_names":25,"comments":0,"pivot_tables":0},"unopened":[],"bounds":{"document_bytes":16777216,"sheet_cells":100000,"rows_first":2000,"rows_last":500,"rows_between":2000,"halvings":0,"cell_chars":16384,"cell_head_chars":4096},"cells_cut":0,"cells_raw":0,"read":"whole","date_system":"1900"}

{"sheet":"MENU","index":0,"n_rows":31,"n_cols":12,"rows_kept":31,"cut":false,"hidden":false,"merged":[[30,2,30,4],[30,5,30,6],[30,8,30,10],[30,11,30,12],[25,1,25,13],[27,2,27,4],[28,2,28,4],[29,2,29,4],[27,5,27,6],[28,5,28,6],[29,5,29,6],[27,8,27,10],[28,8,28,10],[29,8,29,10],[27,11,27,12],[28,11,28,12],[29,11,29,12],[1,1,1,13],[6,1,6,13],[3,1,3,2],[4,1,4,2],[4,3,4,13],[3,3,3,13]]}
[{"$f":"+D5","v":"Well cost tool empty_150614_2131."}]
[null,"Well Cost Estimation Tool V1.0"]
[]
[null,"Name of the project: ",null,"Well cost tool empty"]
[null,"Name of the file",null,{"$f":"MID(CELL(\"FILENAME\",N5),FIND(\"[\",CELL(\"FILENAME\",N34))+1,FIND(\"]\",CELL(\"FILENAME\",N34))-FIND(\"[\",CELL(\"FILENAME\",N34))-5)","v":"Well cost tool empty_150614_2131."}]
[]
[null,"NAVIGATION & TOOLS PANEL "]
[]
[]
[]
[]
[]
[]
[]
[]
{"$rows_left_out":17}
{"sheet":"NPT","index":1,"n_rows":29,"n_cols":14,"rows_kept":29,"cut":false,"hidden":false,"merged":[[1,1,1,13],[3,1,3,13],[16,1,16,13]]}
[{"$f":"+MENU!D5","v":"Well cost tool empty_150614_2131."}]
[null,"WELL NPT AND OVER COST - HISTORICAL"]
[null,null,"AVERAGE","PERCENTAGE ","Well 1","Well 2","Well 3","Well 4","Well 5","Well 6","Well 7","Well 8","Well 9","Well 10"]
[null,"DRILLING"]
[null,"PLANNED TIME ",{"$f":"+IF(ISERROR(AVERAGE(E5:N5)),0,AVERAGE(E5:N5))","v":0},1]
[null,"REAL TIME  - DIFFERENCE",{"$f":"+IF(ISERROR(AVERAGE(E6:N6)),0,AVERAGE(E6:N6))","v":0},{"$f":"IF(ISERROR(C6/C5-1),0,C6/C5-1)","v":0}]
[null,"EXTRA TIME ASSOCIATED TO PLANNING ISSUES",{"$f":"+IF(ISERROR(AVERAGE(E7:N7)),0,AVERAGE(E7:N7))","v":0},{"$f":"IF(ISERROR(C7/$C$6),0,C7/$C$6)","v":0}]
[null,"EXTRA TIME ASSOCIATED TO HUMAN MISTAKES",{"$f":"+IF(ISERROR(AVERAGE(E8:N8)),0,AVERAGE(E8:N8))","v":0},{"$f":"IF(ISERROR(C8/$C$6),0,C8/$C$6)","v":0}]
[null,"EXTRA TIME ASSOCIATED TO GEOLOGICAL FAILURES",0,0]
[null,"EXTRA TIME ASSOCIATED TO STUCK EVENTS ",0,{"$f":"IF(ISERROR(C10/$C$6),0,C10/$C$6)","v":0}]
[null,"PLANNED COST  IN USD",{"$f":"+IF(ISERROR(AVERAGE(D11:N11)),0,AVERAGE(D11:N11))","v":1},1]
[null,"REAL COST - DIFFERENCE   IN USD",0,{"$f":"IF(ISERROR(C12/C11-1),0,C12/C11-1)","v":-1}]
[null,"EXTRA COST ASSOCIATED TO PLANNING ISSUES   IN USD",0,{"$f":"IF(ISERROR(C13/$C$11),0,C13/$C$11)","v":0}]
[null,"EXTRA COST ASSOCIATED TO HUMAN MISTAKES  IN USD",0,{"$f":"IF(ISERROR(C14/$C$11),0,C14/$C$11)","v":0}]
[null,"EXTRA COST ASSOCIATED TO GEOLOGICAL FAILURES  IN USD",0,0]
{"$rows_left_out":15}
{"sheet":"AVERAGE COST","index":2,"n_rows":438,"n_cols":15,"rows_kept":438,"cut":false,"hidden":false,"merged":[[1,1,1,14]]}
[{"$f":"+MENU!D5","v":"Well cost tool empty_150614_2131."}]
[null,"WELL MARKET PRICES IN USD WITHOUT VAT"]
[null,"CODE","NAME","UNIT ","AVERAGE VALUE ","PRICE 1","PRICE 2","PRICE 3","PRICE 4","PRICE 5","PRICE 6","PRICE 7","PRICE 8","PRICE 9","PRICE 10"]
[null,11000101,"Daily Rig Rate","DAY",{"$f":"IF(ISERROR(AVERAGE(F4:O4)),0,AVERAGE(F4:O4))","v":0}]
[null,11000102,"Daily Stack Rate","DAY",{"$f":"IF(ISERROR(AVERAGE(F5:O5)),0,AVERAGE(F5:O5))","v":0}]
[null,11000103,"Daily Stand by Rate w/ crew","DAY",0]
[null,11000104,"Daily Stand by Rate w/o crew","DAY",0]
[null,11000105,"Equipment LIH / DBR","UNIT",0]
[null,11000106,"Personnel - Patio Hand","DAY",0]
[null,11000107,"Reimbursable","GLOBAL",0]
[null,11000108,"Repair Rig","DAY",0]
[null,11000109,"Rig Assistance ","DAY",0]
[null,11000201,"Catering","UNIT",0]
[null,11000202,"Reimbursable","GLOBAL",0]
[null,11200101,"Wood for Pipe Racks","UNIT",0]
{"$rows_left_out":424}
{"sheet":"INITIAL DATA","index":3,"n_rows":119,"n_cols":10,"rows_kept":119,"cut":false,"hidden":false,"merged":[[110,1,110,7],[1,1,1,9],[65,1,65,7],[35,1,35,7],[48,1,48,7],[5,1,5,9],[6,2,6,3],[16,1,16,2],[16,4,16,5],[26,1,26,7]]}
[{"$f":"+MENU!D5","v":"Well cost tool empty_150614_2131."}]
[null,"DRILLING AND COMPLETION PARAMETERS"]
[]
[null,"YEAR OF BEGINNING ",2014]
[]
[null,"PHASE "]
[null,"PHASE No. ",null,null,"PHASE 1","PHASE 2","PHASE 3","PHASE 4","PHASE 5"]
[null,"SECTION (SELECT)","CIVIL WORKS ","MOBILIZATION ","N/A","N/A","N/A","N/A","N/A",{"$f":"+IF(AND(E8=\"N/A\",F8=\"N/A\",G8=\"N/A\",H8=\"N/A\",I8=\"N/A\"),\"N/A\",\"COMPLETION\")","v":"N/A"}]
[null,"DIAMETER DRILL (SELECT)","N/A","N/A",null,null,null,null,null,"N/A"]
[null,"DIAMETER CASING/ LINER OR TUBING ","N/A","N/A"]
[null,"DEPTH TO REACH ",0,0,null,null,null,null,null,{"$f":"+MAX(E11:I11)","v":0}]
[null,"TARGET FORMATION","N/A","N/A"]
[null,"DRILLING TIME (DAYS)","N/A","N/A",null,null,null,null,null,0]
[null,"FLAT TIME (DAYS)"]
[null,"TOTAL TIME ",{"$f":"+C14","v":0},{"$f":"+D14","v":0},{"$f":"+E14+E13","v":0},{"$f":"+F14+F13","v":0},{"$f":"+G14+G13","v":0},{"$f":"+H14+H13","v":0},{"$f":"+I14+I13","v":0},{"$f":"+J14","v":0}]
{"$rows_left_out":105}
{"sheet":"AFE SUMMARY","index":4,"n_rows":102,"n_cols":13,"rows_kept":102,"cut":false,"hidden":false,"merged":[[99,1,99,3],[99,4,99,11],[100,1,100,3],[100,4,100,11],[101,1,101,3],[101,4,101,11],[98,1,98,3],[98,4,98,11],[94,4,94,11],[95,4,95,11],[94,1,94,3],[95,1,95,3],[96,1,96,3],[97,1,97,3],[96,4,96,11],[97,4,97,11],[1,1,1,12],[93,1,93,3],[13,2,13,12],[17,2,17,12],[22,2,22,12],[28,2,28,12],[36,2,36,12],[52,2,52,12],[83,2,83,12]]}
[{"$f":"+MENU!D5","v":"Well cost tool empty_150614_2131."}]
[null,"SUMMARY AFE"]
[null,null,null,{"$f":"+'AFE DETAILED'!D4","v":"SECTION "},{"$f":"+IF('AFE DETAILED'!K4=\"n/a\",\"\",'AFE DETAILED'!K4)","v":"CIVIL WORKS "},{"$f":"+IF('AFE DETAILED'!L4=\"n/a\",\"\",'AFE DETAILED'!L4)","v":"MOBILIZATION "},{"$f":"+IF('AFE DETAILED'!M4=\"n/a\",\"\",'AFE DETAILED'!M4)","v":""},{"$f":"+IF('AFE DETAILED'!N4=\"n/a\",\"\",'AFE DETAILED'!N4)","v":""},{"$f":"+IF('AFE DETAILED'!O4=\"n/a\",\"\",'AFE DETAILED'!O4)","v":""},{"$f":"+IF('AFE DETAILED'!P4=\"n/a\",\"\",'AFE DETAILED'!P4)","v":""},{"$f":"+IF('AFE DETAILED'!Q4=\"n/a\",\"\",'AFE DETAILED'!Q4)","v":""},{"$f":"+IF('AFE DETAILED'!R4=\"n/a\",\"\",'AFE DETAILED'!R4)","v":""},{"$f":"+IF('AFE DETAILED'!S4=\"n/a\",\"\",'AFE DETAILED'!T4)","v":"TOTAL "}]
[null,null,null,{"$f":"+'AFE DETAILED'!D5","v":"DIAMETER CASING, LINER OR TUBING "},{"$f":"+IF(E3=\"\",\"\",'AFE DETAILED'!K5)","v":"CIVIL WORKS "},{"$f":"+IF(F3=\"\",\"\",'AFE DETAILED'!L5)","v":"MOBILIZATION "},{"$f":"+IF(G3=\"\",\"\",'AFE DETAILED'!M5)","v":""},{"$f":"+IF(H3=\"\",\"\",'AFE DETAILED'!N5)","v":""},{"$f":"+IF(I3=\"\",\"\",'AFE DETAILED'!O5)","v":""},{"$f":"+IF(J3=\"\",\"\",'AFE DETAILED'!P5)","v":""},{"$f":"+IF(K3=\"\",\"\",'AFE DETAILED'!Q5)","v":""},{"$f":"+IF(L3=\"\",\"\",'AFE DETAILED'!R5)","v":""},{"$f":"+IF(M3=\"\",\"\",'AFE DETAILED'!T5)","v":"-"}]
[null,null,null,{"$f":"+'AFE DETAILED'!D6","v":"DAY START"},{"$f":"+IF(E3=\"\",\"\",'AFE DETAILED'!K7)","v":"00:00:00"},{"$f":"+IF(F3=\"\",\"\",'AFE DETAILED'!L7)","v":"00:00:00"},{"$f":"+IF(G3=\"\",\"\",'AFE DETAILED'!M7)","v":""},{"$f":"+IF(H3=\"\",\"\",'AFE DETAILED'!N7)","v":""},{"$f":"+IF(I3=\"\",\"\",'AFE DETAILED'!O7)","v":""},{"$f":"+IF(J3=\"\",\"\",'AFE DETAILED'!P7)","v":""},{"$f":"+IF(K3=\"\",\"\",'AFE DETAILED'!Q7)","v":""},{"$f":"+IF(L3=\"\",\"\",'AFE DETAILED'!R7)","v":""},{"$f":"+E5","v":"00:00:00"}]
[null,null,null,"DAY END",{"$f":"+IF(E3=\"\",\"\",E5+'AFE DETAILED'!K9)","v":"00:00:00"},{"$f":"+IF(F3=\"\",\"\",F5+'AFE DETAILED'!L9)","v":"00:00:00"},{"$f":"+IF(G3=\"\",\"\",G5+'AFE DETAILED'!M8+'AFE DETAILED'!M9)","v":""},{"$f":"+IF(H3=\"\",\"\",H5+'AFE DETAILED'!N8+'AFE DETAILED'!N9)","v":""},{"$f":"+IF(I3=\"\",\"\",I5+'AFE DETAILED'!O8+'AFE DETAILED'!O9)","v":""},{"$f":"+IF(J3=\"\",\"\",J5+'AFE DETAILED'!P8+'AFE DETAILED'!P9)","v":""},{"$f":"+IF(K3=\"\",\"\",K5+'AFE DETAILED'!Q8+'AFE DETAILED'!Q9)","v":""},{"$f":"+IF(L3=\"\",\"\",L5+'AFE DETAILED'!R9)","v":""},{"$f":"+L6","v":""}]
[null,null,null,{"$f":"+'AFE DETAILED'!D8","v":"DRILLING TIME"},{"$f":"+IF(E3=\"\",\"\",'AFE DETAILED'!K8)","v":"N/A"},{"$f":"+IF(F3=\"\",\"\",'AFE DETAILED'!L8)","v":"N/A"},{"$f":"+IF(G3=\"\",\"\",'AFE DETAILED'!M8)","v":""},{"$f":"+IF(H3=\"\",\"\",'AFE DETAILED'!N8)","v":""},{"$f":"+IF(I3=\"\",\"\",'AFE DETAILED'!O8)","v":""},{"$f":"+IF(J3=\"\",\"\",'AFE DETAILED'!P8)","v":""},{"$f":"+IF(K3=\"\",\"\",'AFE DETAILED'!Q8)","v":""},{"$f":"+IF(L3=\"\",\"\",'AFE DETAILED'!R8)","v":""},{"$f":"+SUM(E7:L7)","v":0}]
[null,null,null,{"$f":"+'AFE DETAILED'!D9","v":"FLAT TIME"},{"$f":"+IF(E3=\"\",\"\",'AFE DETAILED'!K9)","v":0},{"$f":"+IF(F3=\"\",\"\",'AFE DETAILED'!L9)","v":0},{"$f":"+IF(G3=\"\",\"\",'AFE DETAILED'!M9)","v":""},{"$f":"+IF(H3=\"\",\"\",'AFE DETAILED'!N9)","v":""},{"$f":"+IF(I3=\"\",\"\",'AFE DETAILED'!O9)","v":""},{"$f":"+IF(J3=\"\",\"\",'AFE DETAILED'!P9)","v":""},{"$f":"+IF(K3=\"\",\"\",'AFE DETAILED'!Q9)","v":""},{"$f":"+IF(L3=\"\",\"\",'AFE DETAILED'!R9)","v":""},{"$f":"+SUM(E8:L8)","v":0}]
[null,null,null,{"$f":"+'AFE DETAILED'!D10","v":"TOTAL CUMULATIVE  TIME FOR OPERATION ONLY "},0,0,{"$f":"+IF(G3=\"\",\"\",G8+G7+F9)","v":""},{"$f":"+IF(H3=\"\",\"\",H8+H7+G9)","v":""},"","","",{"$f":"+IF(L3=\"\",\"\",L8+MAX(E9:K9))","v":""},{"$f":"+MAX(E9:L9)","v":0}]
[null,null,null,{"$f":"+'AFE DETAILED'!D11","v":"DEPTH TARGET"},{"$f":"+IF(E3=\"\",\"\",'AFE DETAILED'!K11)","v":0},{"$f":"+IF(F3=\"\",\"\",'AFE DETAILED'!L11)","v":0},{"$f":"+IF(G3=\"\",\"\",'AFE DETAILED'!M11)","v":""},{"$f":"+IF(H3=\"\",\"\",'AFE DETAILED'!N11)","v":""},{"$f":"+IF(I3=\"\",\"\",'AFE DETAILED'!O11)","v":""},{"$f":"+IF(J3=\"\",\"\",'AFE DETAILED'!P11)","v":""},{"$f":"+IF(K3=\"\",\"\",'AFE DETAILED'!Q11)","v":""},{"$f":"+IF(L3=\"\",\"\",'AFE DETAILED'!R11)","v":""},{"$f":"+IF(M3=\"\",\"\",'AFE DETAILED'!T11)","v":0}]
[null,null,null,{"$f":"+'AFE DETAILED'!D12","v":"GEOLOGY FORMATION"},{"$f":"+IF(E3=\"\",\"\",'AFE DETAILED'!K12)","v":"N/A"},{"$f":"+IF(F3=\"\",\"\",'AFE DETAILED'!L12)","v":"N/A"},{"$f":"+IF(G3=\"\",\"\",'AFE DETAILED'!M12)","v":""},{"$f":"+IF(H3=\"\",\"\",'AFE DETAILED'!N12)","v":""},{"$f":"+IF(I3=\"\",\"\",'AFE DETAILED'!O12)","v":""},{"$f":"+IF(J3=\"\",\"\",'AFE DETAILED'!P12)","v":""},{"$f":"+IF(K3=\"\",\"\",'AFE DETAILED'!Q12)","v":""},{"$f":"+IF(L3=\"\",\"\",'AFE DETAILED'!R12)","v":""},{"$f":"+IF(M3=\"\",\"\",'AFE DETAILED'!T12)","v":"-"}]
[]
[null,{"$f":"+'AFE DETAILED'!B13","v":"ITEM"},"SUB-NAME","ACCOUNT",{"$f":"+IF(E3=\"\",\"\",\"Planned Cost\")","v":"Planned Cost"},{"$f":"+IF(F3=\"\",\"\",\"Planned Cost\")","v":"Planned Cost"},"","","","","","","Planned Cost"]
[null,{"$f":"+'AFE DETAILED'!B14","v":"A"},{"$f":"+'AFE DETAILED'!E15","v":"Purchase LAND and/or access permit cost"}]
[null,{"$f":"+'AFE DETAILED'!B15","v":"A1"},{"$f":"+'AFE DETAILED'!E20","v":"TOTAL Purchase land and/or access permit cost"},{"$f":"+'AFE DETAILED'!G16","v":111001},{"$f":"IF(E3=\"\",\"\",'AFE DETAILED'!K20)","v":0},{"$f":"IF(F3=\"\",\"\",'AFE DETAILED'!L20)","v":0},{"$f":"IF(G3=\"\",\"\",'AFE DETAILED'!M20)","v":""},{"$f":"IF(H3=\"\",\"\",'AFE DETAILED'!N20)","v":""},{"$f":"IF(I3=\"\",\"\",'AFE DETAILED'!O20)","v":""},{"$f":"IF(J3=\"\",\"\",'AFE DETAILED'!P20)","v":""},{"$f":"IF(K3=\"\",\"\",'AFE DETAILED'!Q20)","v":""},{"$f":"IF(L3=\"\",\"\",'AFE DETAILED'!R20)","v":""},{"$f":"+SUM(E15:L15)","v":0}]
{"$rows_left_out":88}
{"sheet":"AFE DETAILED","index":5,"n_rows":595,"n_cols":20,"rows_kept":595,"cut":false,"hidden":false,"merged":[[1,1,1,19]]}
[{"$f":"+MENU!D5","v":"Well cost tool empty_150614_2131."}]
[null,"DETAILED AFE "]
[null,null,null,"PHASE No. ",null,null,null,null,null,null,null,null,"PHASE 1","PHASE 2","PHASE 3","PHASE 4","PHASE 5"]
[null,null,null,"SECTION ",null,null,null,null,null,null,{"$f":"+'INITIAL DATA'!C8","v":"CIVIL WORKS "},{"$f":"+'INITIAL DATA'!D8","v":"MOBILIZATION "},{"$f":"IF('INITIAL DATA'!E8=\"N/A\",IF('INITIAL DATA'!F8=\"N/A\",IF('INITIAL DATA'!G8=\"N/A\",IF('INITIAL DATA'!H8=\"N/A\",IF('INITIAL DATA'!I8=\"N/A\",\"N/A\",'INITIAL DATA'!I8),'INITIAL DATA'!H8),'INITIAL DATA'!G8),'INITIAL DATA'!F8),'INITIAL DATA'!E8)","v":"N/A"},{"$f":"IF(M4='INITIAL DATA'!E8,IF('INITIAL DATA'!F8=\"N/A\",IF('INITIAL DATA'!G8=\"N/A\",IF('INITIAL DATA'!H8=\"N/A\",IF('INITIAL DATA'!I8=\"N/A\",\"N/A\",'INITIAL DATA'!I8),'INITIAL DATA'!H8),'INITIAL DATA'!G8),'INITIAL DATA'!F8),IF(M4='INITIAL DATA'!F8, IF('INITIAL DATA'!G8=\"N/A\",IF('INITIAL DATA'!H8=\"N/A\",IF('INITIAL DATA'!I8=\"N/A\",\"N/A\",'INITIAL DATA'!I8),'INITIAL DATA'!H8),'INITIAL DATA'!G8),IF(M4='INITIAL DATA'!G8, IF('INITIAL DATA'!H8=\"N/A\",IF('INITIAL DATA'!I8=\"N/A\",\"N/A\",'INITIAL DATA'!I8),'INITIAL DATA'!H8),IF(M4='INITIAL DATA'!H8, IF('INITIAL DATA'!I8=\"N/A\",\"N/A\",'INITIAL DATA'!I8),IF(M4='INITIAL DATA'!I8,\"N/A\",\"N/A\")))))","v":"N/A"},{"$f":"IF(N4=\"N/A\",\"N/A\",IF(N4='INITIAL DATA'!F8, IF('INITIAL DATA'!G8=\"N/A\",IF('INITIAL DATA'!H8=\"N/A\",IF('INITIAL DATA'!I8=\"N/A\",\"N/A\",'INITIAL DATA'!I8),'INITIAL DATA'!H8),'INITIAL DATA'!G8),IF(N4='INITIAL DATA'!G8, IF('INITIAL DATA'!H8=\"N/A\",IF('INITIAL DATA'!I8=\"N/A\",\"N/A\",'INITIAL DATA'!I8),'INITIAL DATA'!H8),IF(N4='INITIAL DATA'!H8, IF('INITIAL DATA'!I8=\"N/A\",\"N/A\",'INITIAL DATA'!I8),IF(N4='INITIAL DATA'!I8,\"N/A\",\"N/A\")))))","v":"N/A"},{"$f":"IF(O4=\"N/A\",\"N/A\",IF(O4='INITIAL DATA'!G8, IF('INITIAL DATA'!H8=\"N/A\",IF('INITIAL DATA'!I8=\"N/A\",\"N/A\",'INITIAL DATA'!I8),'INITIAL DATA'!H8),IF(O4='INITIAL DATA'!H8, IF('INITIAL DATA'!I8=\"N/A\",\"N/A\",'INITIAL DATA'!I8),IF(O4='INITIAL DATA'!I8,\"N/A\",\"N/A\"))))","v":"N/A"},{"$f":" IF(P4=\"N/A\",\"N/A\",IF(P4='INITIAL DATA'!H8, IF('INITIAL DATA'!I8=\"N/A\",\"N/A\",'INITIAL DATA'!I8),IF(P4='INITIAL DATA'!I8,\"N/A\",\"N/A\")))","v":"N/A"},{"$f":"+'INITIAL DATA'!J8","v":"N/A"},null,"TOTAL "]
[null,null,null,"DIAMETER CASING, LINER OR TUBING ",null,null,null,null,null,null,{"$f":"+K4","v":"CIVIL WORKS "},{"$f":"+L4","v":"MOBILIZATION "},{"$f":"IF(M4=\"N/A\",\"N/A\",OPERATIONS!E8)","v":"N/A"},{"$f":"IF(N4=\"N/A\",\"N/A\",OPERATIONS!F8)","v":"N/A"},{"$f":"IF(O4=\"N/A\",\"N/A\",OPERATIONS!G8)","v":"N/A"},{"$f":"IF(P4=\"N/A\",\"N/A\",OPERATIONS!H8)","v":"N/A"},{"$f":"IF(Q4=\"N/A\",\"N/A\",OPERATIONS!I8)","v":"N/A"},{"$f":"IF(M4=\"N/A\",\"N/A\",OPERATIONS!J8)","v":"N/A"},null,"-"]
[null,null,null,"DAY START",null,null,null,null,null,null,{"$f":"+K7","v":"00:00:00"},{"$f":"+L7","v":"00:00:00"},"00:00:00","00:00:00","00:00:00","00:00:00","00:00:00","00:00:00",null,{"$f":"+T7","v":"N/A"}]
[null,null,null,"DAY START LONG",null,null,null,null,null,null,{"$f":"IF(M4=\"N/A\",0,'INITIAL DATA'!C19)","v":"00:00:00"},{"$f":"IF(M4=\"N/A\",0,'INITIAL DATA'!F19)","v":"00:00:00"},{"$f":"+L7+L9","v":"00:00:00"},{"$f":"+M7+M8+M9","v":"00:00:00"},{"$f":"+N7+N8+N9","v":"00:00:00"},{"$f":"+O7+O8+O9","v":"00:00:00"},{"$f":"+P7+P8+P9","v":"00:00:00"},{"$f":"+Q7+Q8+Q9","v":"00:00:00"},null,{"$f":"IF(M4=\"N/A\",\"N/A\",R7+R9)","v":"N/A"}]
[null,null,null,"DRILLING TIME",null,null,null,null,null,null,{"$f":"+HLOOKUP(K4,'INITIAL DATA'!$C$8:$J$15,6,0)","v":"N/A"},{"$f":"HLOOKUP(L4,'INITIAL DATA'!$C$8:$J$15,6,0)","v":"N/A"},{"$f":"IF(M4=\"n/A\",0,HLOOKUP(M4,'INITIAL DATA'!$C$8:$J$15,6,0))","v":0},{"$f":"IF(N4=\"n/A\",0,HLOOKUP(N4,'INITIAL DATA'!$C$8:$J$15,6,0))","v":0},{"$f":"IF(O4=\"n/A\",0,HLOOKUP(O4,'INITIAL DATA'!$C$8:$J$15,6,0))","v":0},{"$f":"IF(P4=\"n/A\",0,HLOOKUP(P4,'INITIAL DATA'!$C$8:$J$15,6,0))","v":0},{"$f":"IF(Q4=\"n/A\",0,HLOOKUP(Q4,'INITIAL DATA'!$C$8:$J$15,6,0))","v":0},{"$f":"IF(R4=\"n/A\",0,HLOOKUP(R4,'INITIAL DATA'!$C$8:$J$15,6,0))","v":0}]
[null,null,null,"FLAT TIME",null,null,null,null,null,null,{"$f":"IF(M4=\"N/A\",0,HLOOKUP(K4,'INITIAL DATA'!$C$8:$J$15,7,0))","v":0},{"$f":"IF(M4=\"N/A\",0,HLOOKUP(L4,'INITIAL DATA'!$C$8:$J$15,7,0))","v":0},{"$f":"IF(M4=\"N/A\",0,HLOOKUP(M4,'INITIAL DATA'!$C$8:$J$15,7,0))","v":0},{"$f":"IF(N4=\"N/A\",0,HLOOKUP(N4,'INITIAL DATA'!$C$8:$J$15,7,0))","v":0},{"$f":"IF(O4=\"N/A\",0,HLOOKUP(O4,'INITIAL DATA'!$C$8:$J$15,7,0))","v":0},{"$f":"IF(P4=\"N/A\",0,HLOOKUP(P4,'INITIAL DATA'!$C$8:$J$15,7,0))","v":0},{"$f":"IF(Q4=\"N/A\",0,HLOOKUP(Q4,'INITIAL DATA'!$C$8:$J$15,7,0))","v":0},{"$f":"IF(R4=\"N/A\",0,HLOOKUP(R4,'INITIAL DATA'!$C$8:$J$15,7,0))","v":0}]
[null,null,null,"TOTAL CUMULATIVE  TIME FOR OPERATION ONLY ",null,null,null,null,null,null,0,0,{"$f":"+M8+M9","v":0},{"$f":"+M10+N8+N9","v":0},{"$f":"+N10+O8+O9","v":0},{"$f":"+O10+P8+P9","v":0},{"$f":"+P10+Q8+Q9","v":0},{"$f":"+Q10+R9","v":0},null,{"$f":"+R10","v":0}]
[null,null,null,"DEPTH TARGET",null,null,null,null,null,null,{"$f":"+HLOOKUP(K4,'INITIAL DATA'!$C$8:$J$15,4,0)","v":0},{"$f":"+HLOOKUP(L4,'INITIAL DATA'!$C$8:$J$15,4,0)","v":0},{"$f":"IF(M4=\"N/A\",0,HLOOKUP(M4,'INITIAL DATA'!$C$8:$J$15,4,0))","v":0},{"$f":"IF(N4=\"N/A\",0,HLOOKUP(N4,'INITIAL DATA'!$C$8:$J$15,4,0))","v":0},{"$f":"IF(O4=\"N/A\",0,HLOOKUP(O4,'INITIAL DATA'!$C$8:$J$15,4,0))","v":0},{"$f":"IF(P4=\"N/A\",0,HLOOKUP(P4,'INITIAL DATA'!$C$8:$J$15,4,0))","v":0},{"$f":"IF(Q4=\"N/A\",0,HLOOKUP(Q4,'INITIAL DATA'!$C$8:$J$15,4,0))","v":0},{"$f":"IF(R4=\"N/A\",0,HLOOKUP(R4,'INITIAL DATA'!$C$8:$J$15,4,0))","v":0},null,{"$f":"+R11","v":0}]
[null,null,null,"GEOLOGY FORMATION",null,null,null,null,null,null,{"$f":"+HLOOKUP(K4,'INITIAL DATA'!$C$8:$J$15,5,0)","v":"N/A"},{"$f":"+HLOOKUP(L4,'INITIAL DATA'!$C$8:$J$15,5,0)","v":"N/A"},{"$f":"IF(M4=\"N/A\",\"N/A\",HLOOKUP(M4,'INITIAL DATA'!$C$8:$J$15,5,0))","v":"N/A"},{"$f":"IF(N4=\"N/A\",\"N/A\",HLOOKUP(N4,'INITIAL DATA'!$C$8:$J$15,5,0))","v":"N/A"},{"$f":"IF(O4=\"N/A\",\"N/A\",HLOOKUP(O4,'INITIAL DATA'!$C$8:$J$15,5,0))","v":"N/A"},{"$f":"IF(P4=\"N/A\",\"N/A\",HLOOKUP(P4,'INITIAL DATA'!$C$8:$J$15,5,0))","v":"N/A"},{"$f":"IF(Q4=\"N/A\",\"N/A\",HLOOKUP(Q4,'INITIAL DATA'!$C$8:$J$15,5,0))","v":"N/A"},{"$f":"IF(R4=\"N/A\",\"N/A\",HLOOKUP(R4,'INITIAL DATA'!$C$8:$J$15,5,0))","v":"N/A"},null,"-"]
[null,"ITEM","SERVICE CODE","UNIT","COST","SERVICE ","ACCOUNT","ACCOUNT DESCRIPTION ","CONTRACTOR","CONTRACT No.","COST","COST","COST","COST","COST","COST","COST","COST",null,"COST"]
[null,"A",null,null,"PURCHASE LAND AND/OR ACCESS PERMIT COST"]
[null,"A1",null,null,"Purchase LAND and/or access permit cost"]
{"$rows_left_out":581}
{"sheet":"OPERATIONS","index":6,"n_rows":27,"n_cols":13,"rows_kept":27,"cut":false,"hidden":true,"merged":[[1,1,1,12]]}
[]
[null,"OPERATIOSN FOR DIAMETERS SIZE "]
[]
[null,"SECTION IN THE AFE DETAILED ",{"$f":"+'AFE DETAILED'!K4","v":"CIVIL WORKS "},{"$f":"+'AFE DETAILED'!L4","v":"MOBILIZATION "},{"$f":"+'AFE DETAILED'!M4","v":"N/A"},{"$f":"+'AFE DETAILED'!N4","v":"N/A"},{"$f":"+'AFE DETAILED'!O4","v":"N/A"},{"$f":"+'AFE DETAILED'!P4","v":"N/A"},{"$f":"+'AFE DETAILED'!Q4","v":"N/A"},{"$f":"+'AFE DETAILED'!R4","v":"N/A"},null,"DIAMETERS","NUMBER"]
[null,"DIAMETER DRILL ",{"$f":"+C4","v":"CIVIL WORKS "},{"$f":"+D4","v":"MOBILIZATION "},{"$f":"+HLOOKUP(E4,'INITIAL DATA'!$E$8:$J$14,2,0)","v":0},{"$f":"+HLOOKUP(F4,'INITIAL DATA'!$E$8:$J$14,2,0)","v":0},{"$f":"+HLOOKUP(G4,'INITIAL DATA'!$E$8:$J$14,2,0)","v":0},{"$f":"+HLOOKUP(H4,'INITIAL DATA'!$E$8:$J$14,2,0)","v":0},{"$f":"+HLOOKUP(I4,'INITIAL DATA'!$E$8:$J$14,2,0)","v":0},{"$f":"+J4","v":"N/A"},null,{"$f":"+LISTS!B4","v":"26\""},26]
[null,"DIAMETER IN NUMBER","N/A","N/A",{"$f":"+VLOOKUP(E5,$L$4:$M$13,2,0)","v":0},{"$f":"+VLOOKUP(F5,$L$4:$M$13,2,0)","v":0},{"$f":"+VLOOKUP(G5,$L$4:$M$13,2,0)","v":0},{"$f":"+VLOOKUP(H5,$L$4:$M$13,2,0)","v":0},{"$f":"+VLOOKUP(I5,$L$4:$M$13,2,0)","v":0},{"$f":"+IF(I6=\"N/A\",IF(H6=\"N/A\",IF(G6=\"N/A\",IF(F6=\"N/A\",IF(E6=\"N/A\",0,E6),F6),G6),H6),I6)","v":0},null,{"$f":"+LISTS!B5","v":"17 1/2\""},17.5]
[null,"DIAMETER CASING, LINER OR TUBING ","N/A","N/A",{"$f":"+HLOOKUP(E4,'INITIAL DATA'!$E$8:$J$14,3,0)","v":0},{"$f":"+HLOOKUP(F4,'INITIAL DATA'!$E$8:$J$14,3,0)","v":0},{"$f":"+HLOOKUP(G4,'INITIAL DATA'!$E$8:$J$14,3,0)","v":0},{"$f":"+HLOOKUP(H4,'INITIAL DATA'!$E$8:$J$14,3,0)","v":0},{"$f":"+HLOOKUP(I4,'INITIAL DATA'!$E$8:$J$14,3,0)","v":0},{"$f":"+HLOOKUP(J4,'INITIAL DATA'!$E$8:$J$14,3,0)","v":0},null,{"$f":"+LISTS!B6","v":"12 1/4\""},12.25]
[null,"DIAMETER CASING, LINER OR TUBING  IN NUMEBER","N/A","N/A",{"$f":"+VLOOKUP(E7,$L$15:$M$27,2,0)","v":{"$error":"#N/A"}},{"$error":"#N/A"},{"$error":"#N/A"},{"$error":"#N/A"},{"$error":"#N/A"},{"$error":"#N/A"},null,{"$f":"+LISTS!B7","v":"8 1/2\""},8.5]
[null,null,null,null,null,null,null,null,null,null,null,{"$f":"+LISTS!B8","v":"6\""},6]
[null,null,null,null,null,null,null,null,null,null,null,{"$f":"+LISTS!B9","v":"N/A"},"N/A"]
[null,null,null,null,null,null,null,null,null,null,null,{"$f":"+LISTS!B10","v":0},0]
[null,null,null,null,null,null,null,null,null,null,null,{"$f":"+LISTS!B11","v":0},0]
[null,null,null,null,null,null,null,null,null,null,null,{"$f":"+LISTS!B12","v":0},0]
[]
[null,null,null,null,null,null,null,null,null,null,null,"DIAMETERS_TUBE","NUMBER"]
{"$rows_left_out":13}
{"sheet":"LISTS","index":7,"n_rows":733,"n_cols":14,"rows_kept":733,"cut":false,"hidden":true,"merged":[]}
[]
[null,null,null,{"$f":"+'INITIAL DATA'!C4","v":2014}]
[null,"DIAMETERS ","SECTION ","DATE","YESNO","DIAMETERS_TUBE","BITS","HEAD","HANGER","PACKER","YESORNO","QTY","PORCENTAGE","PLACE"]
[null,"26\"","N/A",{"$f":"+DATE($D$2,1,1)","v":"2014-01-01"},"YES","20\"","RENT","YES","EXPANDABLE","HYDRAULIC","YES",0,0,"COMPANY FIELD"]
[null,"17 1/2\"","SURFACE",{"$f":"+D4+1","v":"2014-01-02"},"NO","13 3/8\"","BUY","NO","CONVENTIONAL","MECHANICAL","NO",1,5.0000000000000001E-3,"CONTRACTOR BASE"]
[null,"12 1/4\"","INTERMEDIATE CASING 1",{"$f":"+D5+1","v":"2014-01-03"},"N/A","9 5/8\"","NO USE",null,"BOTH","NO",null,2,0.01]
[null,"8 1/2\"","INTERMEDIATE CASING 2","2014-01-04",null,"7\"",null,null,"NO",null,null,3,1.4999999999999999E-2]
[null,"6\"","INTERMEDIATE LINER","2014-01-05",null,"6\"",null,null,null,null,null,4,0.02]
[null,"N/A","PRODUCTION LINER 1","2014-01-06",null,"5 1/2\"",null,null,null,null,null,5,2.5000000000000001E-2]
[null,null,"PRODUCTION LINER 2","2014-01-07",null,"5\"",null,null,null,null,null,5,0.03]
[null,null,"PRODUCTION CASING 1","2014-01-08",null,"4 1/2\"",null,null,null,null,null,6,3.5000000000000003E-2]
[null,null,"PRODUCTION CASING 2","2014-01-09",null,"4\"",null,null,null,null,null,7,0.04]
[null,null,null,"2014-01-10",null,"3 1/2\"",null,null,null,null,null,8,4.4999999999999998E-2]
[null,null,null,"2014-01-11",null,"OPEN HOLE",null,null,null,null,null,9,0.05]
[null,null,null,"2014-01-12",null,"N/A",null,null,null,null,null,10,5.5E-2]
{"$rows_left_out":718}