{"text_format":"1","workbook":"xlsx","n_sheets":11,"sheets":["Datos de entrada","Bombas coincidentes","Linea de impulsión","Pozo humedo","Optimización","K accesorios","Datos curvas","Prop. Agua","Tuberías","Base de datos","APU"],"not_rendered":{"charts":1,"images":2,"macros":1,"external_links":0,"defined_names":20,"comments":2,"pivot_tables":0},"unopened":[],"bounds":{"document_bytes":16777216,"sheet_cells":100000,"rows_first":2000,"rows_last":500,"rows_between":2000,"halvings":0,"cell_chars":16384,"cell_head_chars":4096},"cells_cut":0,"cells_raw":0,"read":"whole","date_system":"1900"}

{"sheet":"Datos de entrada","index":0,"n_rows":40,"n_cols":7,"rows_kept":40,"cut":false,"hidden":false,"merged":[[23,2,23,4],[24,2,24,4],[16,2,16,4],[17,2,17,4],[39,2,39,6],[38,2,38,4],[28,2,28,4],[2,1,2,7],[4,2,4,6],[35,2,35,4],[36,2,36,4],[37,2,37,4],[19,2,19,6],[29,2,29,4],[30,2,30,4],[31,2,31,4],[32,2,32,4],[33,2,33,4],[34,2,34,4],[6,2,6,6],[25,2,25,4],[26,2,26,4],[27,2,27,4],[7,2,7,4],[20,2,21,4],[22,2,22,4],[8,2,8,4],[9,2,9,4],[10,2,10,4],[11,2,11,4],[12,2,12,4],[13,2,13,4],[14,2,14,4],[15,2,15,4]]}
[]
[]
[null,"DATOS DE ENTRADA"]
[]
[null,null,"Ingresar los siguientes datos:"]
[]
[null,null,"DATOS DE ENTRADA"]
[null,null,"Caudal de diseño",null,null,20,"m3/hr"]
[null,null,"Cota terreno",null,null,45,"msnm"]
[null,null,"Cota Batea afluente a la EBAR",null,null,43.63,"msnm"]
{"$rows_left_out":31}
{"sheet":"Bombas coincidentes","index":1,"n_rows":35,"n_cols":23,"rows_kept":35,"cut":false,"hidden":false,"merged":[[12,15,12,21],[14,7,15,7],[14,1,15,1],[14,2,15,2],[14,3,15,3],[14,5,15,5],[12,6,12,9],[9,2,9,4],[12,2,12,3],[1,0,1,13],[4,6,4,8],[5,6,5,8],[6,6,6,8],[7,6,7,8],[3,2,3,10],[9,6,9,8],[10,6,10,8]]}
[]
["BOMBAS DISPONIBLES PARA LOS DATOS SUMINISTRADOS"]
[]
[null,null,"INFORMACIÓN DEL PUNTO BOMBEO"]
[null,null,"Caudal",{"$f":"Q/3.6","v":5.5555555555555554},"l/s",null,"Pérdidas por fricción Impulsión 1",null,null,{"$f":"'Linea de impulsión'!D24","v":0.24598152373760285},"m"]
[null,null,"Caudal",{"$f":"'Datos de entrada'!F8","v":20},"m3/hr",null,"Pérdidas menores Impulsión 1",null,null,{"$f":"'Linea de impulsión'!D27","v":0.65876514574120215},"m"]
[null,null,"Altura Geométrica",{"$f":"'Datos de entrada'!F11-'Pozo humedo'!D17","v":4.8500000000000014},"m",null,"Pérdidas por fricción Impulsión 2",null,null,{"$f":"'Linea de impulsión'!H24","v":1.0138713652268347},"m"]
[null,null,"Altura Total",{"$f":"D7+'Linea de impulsión'!D29+'Linea de impulsión'!H29","v":7.1316940630021595},"m",null,"Pérdidas menores Impulsión 2",null,null,{"$f":"'Linea de impulsión'!H27","v":0.36307602829651825},"m"]
[]
[null,null,"VALIDACIÓN DE LAS POSIBLES BOMBAS ",null,null,null,"Peso específico ",null,null,{"$f":"VLOOKUP('Linea de impulsión'!D7,'Prop. Agua'!$A$3:$B$16,2,FALSE)","v":9.798},"kN/m3"]
{"$rows_left_out":26}
{"sheet":"Linea de impulsión","index":2,"n_rows":29,"n_cols":9,"rows_kept":29,"cut":false,"hidden":false,"merged":[[8,7,8,8],[8,3,8,4],[1,1,1,9],[4,2,4,4],[11,2,11,4],[11,6,11,8],[7,3,7,4]]}
[]
[null,"DIMENSIONAMIENTO LÍNEA DE IMPULSIÓN"]
[]
[]
[null,null,"DATOS DE ENTRADA TUBERÍA DE IMPULSIÓN"]
[null,null,"Longitud ",{"$f":"'Datos de entrada'!F12","v":50},"m"]
[null,null,"Temperatura",{"$f":"'Datos de entrada'!F13","v":15},"ºC"]
[]
[null,null,"Material impulsión 1",{"$f":"Optimización!O3","v":"HD"},null,null,"Material impulsión 2",{"$f":"Optimización!O4","v":"GRP"}]
[null,null,"Longitud impulsión 1",{"$f":"'Pozo humedo'!D20","v":3.3999999999999986},"m",null,"longitud impulsión 2",{"$f":"D6","v":50},"m"]
{"$rows_left_out":20}
{"sheet":"Pozo humedo","index":3,"n_rows":20,"n_cols":12,"rows_kept":20,"cut":false,"hidden":false,"merged":[[1,1,1,16],[4,2,4,4]]}
[]
[null,"DIMENSIONAMIENTO POZO HÚMEDO DEL BOMBEO DE AGUA RESIDUAL"]
[]
[]
[null,null,"DATOS DE ENTRADA DEL POZO HÚMEDO"]
[null,null,"Tiempo del ciclo",{"$f":"'Datos de entrada'!F14","v":15},"min"]
[null,null,"(CT) Cota terreno",{"$f":"'Datos de entrada'!F9","v":45},"msnm",null,null,null,null,null,"CT:",{"$f":"D7","v":45}]
[null,null,"(CAF) Cota Batea entrada afluente",{"$f":"'Datos de entrada'!F10","v":43.63},"msnm"]
[null,null,"Sumergencia mínima de la bomba",{"$f":"IFERROR(IF(VLOOKUP(\"X\",'Bombas coincidentes'!$B$17:$M$35,10,FALSE)/1000>0.5,VLOOKUP(\"X\",'Bombas coincidentes'!$B$17:$M$35,10,FALSE)/1000,0.5),0.5)","v":0.5},"m"]
[]
{"$rows_left_out":11}
{"sheet":"Optimización","index":4,"n_rows":82,"n_cols":34,"rows_kept":82,"cut":false,"hidden":false,"merged":[[1,13,1,14],[1,17,1,18],[1,1,1,5],[11,2,11,3],[6,2,6,3],[7,2,7,3],[8,2,8,3],[9,2,9,3],[10,2,10,3],[8,9,11,9],[3,1,3,2],[13,17,13,24],[5,21,5,22],[2,21,2,22],[3,21,3,22],[4,21,4,22],[13,8,13,15],[14,1,15,1],[15,8,16,9],[15,10,16,10],[15,11,16,11],[15,12,16,12],[15,13,16,13],[15,14,16,14],[15,15,16,15],[15,23,16,23],[15,24,16,24],[15,17,16,18],[15,19,16,19],[15,20,16,20],[15,21,16,21],[15,22,16,22],[68,27,68,33],[9,27,9,33],[67,27,67,32],[81,27,81,32],[1,26,1,34],[2,27,3,33],[10,32,11,32],[10,33,11,33],[10,27,11,27],[12,27,12,33],[4,27,4,32],[5,27,6,27],[10,28,11,28],[10,29,11,29],[10,30,11,30],[10,31,11,31]]}
[]
[null,"OPTIMIZACIÓN",null,null,null,null,null,null,"mm","in",1,2,null,"No. De opciones",null,{"$f":"COUNT(C17:C56)","v":19},null,"COSTOS",null,null,null,null,null,null,null,null,"PRESUPUESTO PRELIMINAR"]
[null,null,null,null,null,null,null,null,32,1.25,{"$f":"IF(AND(I3>'Linea de impulsión'!$D$17,I3<'Linea de impulsión'!$D$16),\"1\",\"\")","v":""},{"$f":"IF(AND(I3>'Linea de impulsión'!$H$17,I3<'Linea de impulsión'!$H$16),\"1\",\"\")","v":""},null,"Impulsión 1","HD",2.5,null,"BOMBA",{"$f":"VLOOKUP(N6,$B$17:$G$56,6,FALSE)","v":3700000},null,null,"Potencia útil",null,{"$f":"'Bombas coincidentes'!J11","v":0.38820188016275087},"kW",null,null,"Nota: El presente presupuesto es una base para determinar el costo del proyecto óptimo por lo cual no tiene en cuenta los costos de excavación, demoliciones o reparaciones y por lo tanto no se debe tomar como presupuesto final del proyecto. "]
[null,null,null,null,null,null,null,null,40,1.5,{"$f":"IF(AND(I4>'Linea de impulsión'!$D$17,I4<'Linea de impulsión'!$D$16),\"1\",\"\")","v":""},{"$f":"IF(AND(I4>'Linea de impulsión'!$H$17,I4<'Linea de impulsión'!$H$16),\"1\",\"\")","v":""},null,"Impulsión 2","GRP",3,null,"ENERGÍA",{"$f":"VLOOKUP(N6,$B$17:$G$56,5,FALSE)","v":21664964.107299998},null,null,"Tiempo del ciclo requerido",null,{"$f":"'Datos de entrada'!F14","v":15},"min"]
[null,null,null,null,null,null,null,null,50,2,{"$f":"IF(AND(I5>'Linea de impulsión'!$D$17,I5<'Linea de impulsión'!$D$16),\"1\",\"\")","v":""},{"$f":"IF(AND(I5>'Linea de impulsión'!$H$17,I5<'Linea de impulsión'!$H$16),\"1\",\"\")","v":""},null,"BOMBA",null,null,null,"TUBERÍA 1",{"$f":"P30","v":95144.39999999998},null,null,"Horas de bombeo en 1 año",null,{"$f":"(((60/X4)*(X4/2))/60)*24*365","v":4380},"hr/año",null,null,"COSTOS DE LA BOMBA ÓPTIMA"]
[null,null,null,null,null,null,null,null,65,2.5,{"$f":"IF(AND(I6>'Linea de impulsión'!$D$17,I6<'Linea de impulsión'!$D$16),\"1\",\"\")","v":"1"},{"$f":"IF(AND(I6>'Linea de impulsión'!$H$17,I6<'Linea de impulsión'!$H$16),\"1\",\"\")","v":"1"},null,"DRV/A50-155-1.8M",null,null,null,"TUBERÍA 2",{"$f":"Y30","v":224640},null,null,"Horas de bombeo en el periodo",null,{"$f":"X5*'Datos de entrada'!F16","v":87600},"hr/periodo",null,null,"MODELO","EFICIENCIA","POTENCIA","COSTO ENERGÍA","COSTO ENERGÍA (VPN)","COSTO DE ADQUISICIÓN"]
[null,null,"Bomba Óptima",null,"DRV/A50-155-1.8M",null,null,null,80,3,{"$f":"IF(AND(I7>'Linea de impulsión'!$D$17,I7<'Linea de impulsión'!$D$16),\"1\",\"\")","v":""},{"$f":"IF(AND(I7>'Linea de impulsión'!$H$17,I7<'Linea de impulsión'!$H$16),\"1\",\"\")","v":"1"},null,null,null,null,null,"TOTAL",{"$f":"SUM(S3:S6)","v":25684748.507299997},null,null,null,null,null,null,null,null,null," [%]","kW","$/año","$/periodo","$"]
[null,null,"Material impulsión 1",null,"HD",null,null,null,100,4,{"$f":"IF(AND(I8>'Linea de impulsión'!$D$17,I8<'Linea de impulsión'!$D$16),\"1\",\"\")","v":""},{"$f":"IF(AND(I8>'Linea de impulsión'!$H$17,I8<'Linea de impulsión'!$H$16),\"1\",\"\")","v":""},null,null,null,null,null,null,null,null,null,null,null,null,null,null,null,{"$f":"E7","v":"DRV/A50-155-1.8M"},{"$f":"VLOOKUP(AB8,$B$17:$G$56,2,FALSE)","v":74.552999999999997},{"$f":"VLOOKUP(AB8,$B$17:$G$56,3,FALSE)","v":0.52070591413189393},{"$f":"VLOOKUP(AB8,$B$17:$G$56,4,FALSE)","v":1824553.5231181562},{"$f":"VLOOKUP(AB8,$B$17:$G$56,5,FALSE)","v":21664964.107299998},{"$f":"VLOOKUP(AB8,$B$17:$G$56,6,FALSE)","v":3700000}]
[null,null,"Material impulsión 2",null,"GRP",null,null,null,null,"MATERIALES POR TUBERÍA DE IMPULSIÓN","ACERO","PVC"]
[null,null,"Diámetro impulsión 1",null,2.5,null,null,null,null,null,"HD","GRP",null,null,null,null,null,null,null,null,null,null,null,null,null,null,null,"COSTOS DE LAS TUBERÍAS ÓPTIMAS"]
{"$rows_left_out":73}
{"sheet":"K accesorios","index":5,"n_rows":20,"n_cols":4,"rows_kept":20,"cut":false,"hidden":true,"merged":[[0,1,1,1],[0,0,1,0]]}
["Accesorios","K","Impulsion 1","Impulsion 2"]
[null,null,"K*Cant","K*Cant"]
["Válvula de globo",10,{"$f":"B3*'Datos de entrada'!F23","v":0},{"$f":"B3*'Datos de entrada'!G23","v":0}]
["Válvula de mariposa",5,{"$f":"B4*'Datos de entrada'!F24","v":0},{"$f":"B4*'Datos de entrada'!G24","v":0}]
["Válvula de Cheque",2.5,{"$f":"B5*'Datos de entrada'!F25","v":2.5},{"$f":"B5*'Datos de entrada'!G25","v":0}]
["Válvula de compuerta",0.2,{"$f":"B6*'Datos de entrada'!F26","v":0.2},{"$f":"B6*'Datos de entrada'!G26","v":0}]
["Codo 90 radio corto",0.9,{"$f":"B7*'Datos de entrada'!F27","v":0},{"$f":"B7*'Datos de entrada'!G27","v":2.7}]
["Codo 90 radio medio",0.8,{"$f":"B8*'Datos de entrada'!F28","v":0},{"$f":"B8*'Datos de entrada'!G28","v":0}]
["Codo 90 gran radio",0.6,{"$f":"B9*'Datos de entrada'!F29","v":0.6},{"$f":"B9*'Datos de entrada'!G29","v":0}]
["Codo 45",0.4,{"$f":"B10*'Datos de entrada'!F30","v":0},{"$f":"B10*'Datos de entrada'!G30","v":0.8}]
{"$rows_left_out":11}
{"sheet":"Datos curvas","index":6,"n_rows":47,"n_cols":23,"rows_kept":47,"cut":false,"hidden":true,"merged":[[12,20,12,22],[11,19,11,23],[0,0,0,11],[11,1,11,12],[11,13,11,14],[4,2,4,4],[5,2,5,4],[6,2,6,4],[7,2,7,4],[8,2,8,4],[3,2,3,4],[4,9,4,11],[5,9,5,11],[6,9,6,11],[13,1,14,1],[57,6,57,7],[22,24,22,25],[13,2,13,7],[13,8,13,13],[13,24,13,25],[14,24,14,25],[13,20,13,21],[13,15,13,16]]}
["CURVA DEL SISTEMA Y CURVA DE LA BOMBA"]
[]
[]
[null,null,"Datos",null,null,"Impulsión 1","Impulsión 2"]
[null,null,"Longitud tubería [m]",null,null,{"$f":"'Linea de impulsión'!D10","v":3.3999999999999986},{"$f":"'Linea de impulsión'!H10","v":50},null,null,"Nivel de Entrega",null,null,{"$f":"'Datos de entrada'!F11","v":47},"msnm"]
[null,null,"Diametro [pulg]",null,null,{"$f":"'Linea de impulsión'!D18","v":2.5},{"$f":"'Linea de impulsión'!H18","v":3},null,null,"(NA) Nivel de Arranque",null,null,{"$f":"'Pozo humedo'!D16","v":43.35},"msnm"]
[null,null,"Rugosidad absoluta \"ε\" [mm]",null,null,{"$f":"'Linea de impulsión'!D19","v":0.25},{"$f":"'Linea de impulsión'!H19","v":0.03},null,null,"(NP) Nivel de Parada",null,null,{"$f":"'Pozo humedo'!D17","v":42.15},"msnm"]
[null,null,"u [m2/s]",null,null,{"$f":"'Linea de impulsión'!D21","v":1.139E-6},{"$f":"'Linea de impulsión'!H21","v":1.139E-6}]
[null,null,"SK [m]",null,null,{"$f":"'Linea de impulsión'!D26","v":4.2},{"$f":"'Linea de impulsión'!H26","v":4.8}]
[]
{"$rows_left_out":38}
{"sheet":"Prop. Agua","index":7,"n_rows":17,"n_cols":8,"rows_kept":17,"cut":false,"hidden":true,"merged":[[0,0,0,7]]}
["PROPIEDADES FÍSICAS DEL AGUA"]
["Temperatura (ºC)","Peso específico (kN/m3)","Densidad (kg/m3)","Módulo de elasticidad (kN/m2)","Viscosidad dinámica (N*s/m2)","Viscosidad cinemática (m2/s)","Tensión superficial (N/m)","Presión de vapor (kN/m2)"]
[0,9.8049999999999997,999.9,{"$f":"1.98 * 10^6","v":1980000},{"$f":"1.781 * 10^-3","v":1.781E-3},{"$f":"1.785 * 10^-6","v":1.7849999999999999E-6},7.6499999999999999E-2,0.61]
[5,9.8070000000000004,1000,{"$f":"2.05 * 10^6","v":2049999.9999999998},{"$f":"1.518 * 10^-3","v":1.518E-3},{"$f":"1.519 * 10^-6","v":1.5189999999999998E-6},7.4899999999999994E-2,0.87]
[10,9.8040000000000003,999.7,{"$f":"2.1 * 10^6","v":2100000},{"$f":"1.307 * 10^-3","v":1.307E-3},{"$f":"1.306 * 10^-6","v":1.3060000000000001E-6},7.4200000000000002E-2,1.23]
[15,9.798,999.1,{"$f":"2.15 * 10^6","v":2150000},{"$f":"1.139 * 10^-3","v":1.139E-3},{"$f":"1.139 * 10^-6","v":1.139E-6},7.3499999999999996E-2,1.7]
[20,9.7889999999999997,998.2,{"$f":"2.17 * 10^6","v":2170000},{"$f":"1.002 * 10^-3","v":1.0020000000000001E-3},{"$f":"1.003 * 10^-6","v":1.0029999999999998E-6},7.2800000000000004E-2,2.34]
[25,9.7769999999999992,997,{"$f":"2.22 * 10^6","v":2220000},{"$f":"0.89 * 10^-3","v":8.9000000000000006E-4},{"$f":"0.893 * 10^-6","v":8.9299999999999996E-7},7.1999999999999995E-2,3.17]
[30,9.7639999999999993,995.7,{"$f":"2.25 * 10^6","v":2250000},{"$f":"0.798 * 10^-3","v":7.980000000000001E-4},{"$f":"0.8 * 10^-6","v":7.9999999999999996E-7},7.1199999999999999E-2,4.24]
[40,9.73,992.2,{"$f":"2.28 * 10^6","v":2280000},{"$f":"0.653 * 10^-3","v":6.5300000000000004E-4},{"$f":"0.658 * 10^-6","v":6.5799999999999999E-7},6.9599999999999995E-2,7.38]
{"$rows_left_out":8}
{"sheet":"Tuberías","index":8,"n_rows":18,"n_cols":3,"rows_kept":18,"cut":false,"hidden":true,"merged":[[0,0,0,2],[10,0,10,1]]}
["RUGOSIDAD ABSOLUTA DE MATERIALES"]
["Material","SIMBOLO","ε (mm)"]
["Plástico (PE, PVC)","PVC",1.5E-3]
["Poliéster reforzado con fibra de vidrio","GRP",0.03]
["Acero comercial","ACERO",0.45]
["Hierro Ductil","HD",0.25]
["Concreto","CCP",0.12]
["Polietileno","PEAD",7.0000000000000001E-3]
["Bibliografia : tabla 9.5 EPM"]
[]
{"$rows_left_out":9}
{"sheet":"Base de datos","index":9,"n_rows":113,"n_cols":35,"rows_kept":113,"cut":false,"hidden":false,"merged":[[1,25,2,25],[1,27,2,27],[1,0,2,0],[1,1,2,1],[1,2,2,2],[1,3,1,18],[2,3,2,9],[2,10,2,16]]}
[1,2,3,4,5,6,7,8,9,{"$f":"I1+1","v":10},{"$f":"J1+1","v":11},12,13,14,15,16,17,18,19,20,21,22,23,{"$f":"W1+1","v":24},{"$f":"X1+1","v":25},{"$f":"Y1+1","v":26},{"$f":"Z1+1","v":27},{"$f":"AA1+1","v":28},{"$f":"AB1+1","v":29},{"$f":"AC1+1","v":30},{"$f":"AD1+1","v":31},{"$f":"AE1+1","v":32},{"$f":"AF1+1","v":33},{"$f":"AG1+1","v":34},35]
["FABRICANTE","SERIE","IDENTIFICACION","CURVA CARACTERÍSTICA",null,null,null,null,null,null,null,null,null,null,null,null,null,null,null,null,"VALIDACIÓN DE LA CURVA",null,null,null,"PASO DE SÓLIDOS","TIPO DE CONEXIÓN","DIÁMETRO DESCARGA","MOTOR","POTENCIA EJE DEL MOTOR","VELOCIDAD","SUMERGENCIA MÍNIMA","f IMPULSOR","ECUACIÓN","EFICIENCIA","COSTO DE ADQUISICIÓN"]
[null,null,null,"Q [m3/h]",null,null,null,null,null,null,"H [m]",null,null,null,null,null,null,"ECUACIÓN","R²",null,"Q [m3/h]","H [m]","VALIDACIÓN",null,"[mm]",null,"DN [mm]",null,"[kW]","[R.P.M]","[mm]","[mm]","EFICIENCIA"," [%]"," [%]"]
["ABS","AS","AS0530 S12/2W",0,5,10,15,20,25,26.53,12.27,10.78,9.3699999999999992,7.72,6.07,3.84,3.22,"H=-0.0033*Q^2-0.2478*Q+12.202",0.999,null,{"$f":"Q","v":20},{"$f":"-0.0033*Q^2-0.2478*Q+12.202","v":5.9260000000000002},{"$f":"IF(AND(V4>H-1,V4<H+1,V4>Q4),\"OK\",\"\")","v":""},null,40,"Roscado",50,"Monofásico",1.2,2900,331,110,"e=-0.0437*Q^2+1.7589*Q+33.614",{"$f":"-0.0437*Q^2+1.7589*Q+33.614","v":51.311999999999998},3000000]
["ABS","AS","AS0530 S12/2D",0,5,10,15,20,25,26.53,12.27,10.78,9.3699999999999992,7.72,6.07,3.84,3.22,"H=-0.0033*Q^2-0.2478*Q+12.202",0.999,null,20,{"$f":"-0.0033*Q^2-0.2478*Q+12.202","v":5.9260000000000002},"",null,40,"Roscado",50,"Trifásico",1.2,2900,331,110,"e=-0.0507*Q^2+1.8918*Q+38.34",{"$f":"-0.0507*Q^2+1.8918*Q+38.34","v":55.896000000000001},{"$f":"AI4+100000","v":3100000}]
["ABS","AS","AS0530 S17/2D",0,5,10,15,20,25,30,16.11,14.13,12.4,10.73,8.8800000000000008,6.89,5.07,"H=-0.0004*Q^2-0.3529*Q+16.027",0.99960000000000004,null,20,{"$f":"-0.0004*Q^2-0.3529*Q+16.027","v":8.8090000000000011},"",null,40,"Roscado",50,"Trifásico",1.7,2900,331,125,"e=-0.0476*Q^2+1.8571*Q+43.333",{"$f":"-0.0476*Q^2+1.8571*Q+43.333","v":61.434999999999988},{"$f":"AI5+100000","v":3200000}]
["ABS","AS","AS0530 S26/2D",0,5,10,15,20,25,35,21.24,19.079999999999998,17.059999999999999,15.43,13.65,11.51,6.05,"H=-0.0029*Q^2-0.3178*Q+20.935",0.99670000000000003,null,20,{"$f":"-0.0029*Q^2-0.3178*Q+20.935","v":13.418999999999997},"",null,40,"Roscado",50,"Trifásico",2.6,2900,331,142,"e=-0.0383*Q^2+1.664*Q+48.781",{"$f":"-0.0383*Q^2+1.664*Q+48.781","v":66.741},3300000]
["ABS","AS","AS0630 S10/4W",0,8.1199999999999992,15,20,25,30,35,5.36,4.51,3.58,2.97,2.36,1.87,1.3,"H=0.0002*Q^2-0.1239*Q+5.4062",0.99870000000000003,null,20,{"$f":"0.0002*Q^2-0.1239*Q+5.4062","v":3.0082000000000004},"",null,60,"Brida DN",65,"Monofásico",1,1450,348,130,"e=-0.0283*Q^2+1.3957*Q+53.084",{"$f":"-0.0283*Q^2+1.3957*Q+53.084","v":69.677999999999997},3400000]
["ABS","AS","AS0630 S10/4W",0,8.1199999999999992,20,30,40,50,53.9,7.79,6.88,5.56,4.63,3.57,2.4700000000000002,1.97,"H=-3E-05*Q^2-0.1047*Q+7.7531",0.99939999999999996,null,20,{"$f":"-0.00003*Q^2-0.1047*Q+7.7531","v":5.6471},"",null,60,"Brida DN",65,"Monofásico",1,1450,348,160,"e=-0.011*Q^2+0.8783*Q+34.006",{"$f":"-0.011*Q^2+0.8783*Q+34.006","v":47.171999999999997},3500000]
["ABS","AS","AS0630 S13/4D",0,8.1199999999999992,15,20,25,30,35,5.36,4.51,3.58,2.97,2.36,1.87,1.3,"H=0.0002*Q^2-0.1239*Q+5.4062",0.99870000000000003,null,20,{"$f":"0.0002*Q^2-0.1239*Q+5.4062","v":3.0082000000000004},"",null,60,"Brida DN",65,"Trifásico",1.3,1450,348,130,"e=-0.0283*Q^2+1.3957*Q+38.084",{"$f":"-0.0283*Q^2+1.3957*Q+38.084","v":54.677999999999997},3600000]
{"$rows_left_out":104}
{"sheet":"APU","index":10,"n_rows":51,"n_cols":19,"rows_kept":51,"cut":false,"hidden":false,"merged":[[0,8,0,14],[0,16,0,18],[0,0,0,6]]}
["SUMINISTROS",null,null,null,null,null,null,null,"INSTALACIÓN",null,null,null,null,null,null,null,"VÁLVULAS"]
["Ítem","PVC","GRP","CCP","PEAD","ACERO","HD",null,"Ítem","PVC","GRP","CCP","PEAD","ACERO","HD",null,"ITEM","SUMINISTRO","INSTALACIÓN"]
[1,2,3,4,5,6,7,null,1,2,3,4,5,6,7,null,"Válvula de globo 1.25\"",1000,2000]
["Tubería 1.25\"",10000,2000,3000,4000,5000,6000,null,"Tubería 1.25\"",10000,2000,3000,4000,5000,6000,null,"Válvula de globo 1.5\"",{"$f":"R3+1","v":1001},{"$f":"S3+1","v":2001}]
["Tubería 1.5\"",{"$f":"B4+1","v":10001},{"$f":"C4+1","v":2001},{"$f":"D4+1","v":3001},{"$f":"E4+1","v":4001},{"$f":"F4+1","v":5001},{"$f":"G4+1","v":6001},null,"Tubería 1.5\"",{"$f":"J4+1","v":10001},{"$f":"K4+1","v":2001},{"$f":"L4+1","v":3001},{"$f":"M4+1","v":4001},{"$f":"N4+1","v":5001},{"$f":"O4+1","v":6001},null,"Válvula de globo 2\"",{"$f":"R4+1","v":1002},{"$f":"S4+1","v":2002}]
["Tubería 2\"",10002,2002,3002,4002,5002,{"$f":"G5+1","v":6002},null,"Tubería 2\"",10002,2002,3002,4002,5002,{"$f":"O5+1","v":6002},null,"Válvula de globo 2.5\"",1003,2003]
["Tubería 2.5\"",10003,2003,3003,4003,5003,6003,null,"Tubería 2.5\"",10003,2003,3003,4003,5003,6003,null,"Válvula de globo 3\"",1004,2004]
["Tubería 3\"",10004,2004,3004,4004,5004,6004,null,"Tubería 3\"",10004,2004,3004,4004,5004,6004,null,"Válvula de globo 4\"",1005,2005]
["Tubería 4\"",10005,2005,3005,4005,5005,6005,null,"Tubería 4\"",10005,2005,3005,4005,5005,6005,null,"Válvula de mariposa 1.25\"",1006,2006]
["Codo 90 radio corto 1.25\"",10006,2006,3006,4006,5006,6006,null,"Codo 90 radio corto 1.25\"",10006,2006,3006,4006,5006,6006,null,"Válvula de mariposa 1.5\"",1007,2007]
{"$rows_left_out":41}